BDBM50005452 1H-Indole-2-carboxylic acid (4,4-diphenyl-but-3-enyl)-amide::CHEMBL267507
SMILES O=C(NCCC=C(c1ccccc1)c1ccccc1)c1cc2ccccc2[nH]1
InChI Key InChIKey=RECBCPRLEMVMTD-UHFFFAOYSA-N
Data  1 KI
  Tab Delimited (TSV)   2D SDfile   Computed 3D by Vconf -m prep SDfile
Find this compound or compounds like it in BindingDB:
Activity Spreadsheet -- Enzyme Inhibition Constant Data from BindingDB
Found 1 hit for monomerid = 50005452
TargetCholecystokinin receptor type A(RAT)
Center For Bio-Pharmaceutical Sciences
Curated by ChEMBL
LigandPNGBDBM50005452(1H-Indole-2-carboxylic acid (4,4-diphenyl-but-3-en...)
Affinity DataKi: >2.00E+3nM. Assay description: Compound was evaluated for its ability to inhibit [3H]-L-364,718 binding Cholecystokinin type A receptor in rat pancreas membranes
In DepthDetails ArticlePubMed