BDBM500055 US11021457, Compound 59
SMILES CC(C)[C@H](NC=C1C(=O)CC(CC1=O)c1ccccc1)C(=O)N[C@@H](CCCNC(N)=O)C(=O)Nc1cccc2C(=O)N(Cc12)C1CCC(=O)NC1=O
InChI Key InChIKey=XMDPELIGWKQBHI-LBQOLGSKSA-N
Data  1 IC50
  Tab Delimited (TSV)   2D SDfile   Computed 3D by Vconf -m prep SDfile
Find this compound or compounds like it in BindingDB:
Activity Spreadsheet -- Enzyme Inhibition Constant Data from BindingDB
Found 1 hit for monomerid = 500055
TargetMicrotubule-associated proteins 1A/1B light chain 3B(Human)
Wigen Biomedicine Technology (Shanghai)
US Patent
LigandPNGBDBM500055(US11021457, Compound 59)
Affinity DataIC50: <50nM. Assay description: By constructing a prokaryotic expression system, the LC3B protein was successfully expressed and purified, and a preliminary screening and verificati...
Ligand InfoKEGGPC cidPC sid
In DepthDetails US Patent