BDBM50005505 2-(5-Dimethylaminomethyl-furan-2-ylmethylsulfanyl)-N-[2-(5-dimethylaminomethyl-furan-2-ylmethylsulfanyl)-ethyl]-acetamide::CHEMBL12941
SMILES CN(C)Cc1ccc(CSCCNC(=O)CSCc2ccc(CN(C)C)o2)o1
InChI Key InChIKey=NFYOLQNDIDXOOH-UHFFFAOYSA-N
Data  1 IC50
  Tab Delimited (TSV)   2D SDfile   Computed 3D by Vconf -m prep SDfile
Find this compound or compounds like it in BindingDB:
Activity Spreadsheet -- Enzyme Inhibition Constant Data from BindingDB
Found 1 hit for monomerid = 50005505
TargetAcetylcholinesterase(Homo sapiens (Human))
University Of South Carolina
Curated by ChEMBL
LigandPNGBDBM50005505(2-(5-Dimethylaminomethyl-furan-2-ylmethylsulfanyl)...)
Affinity DataIC50:  2.50E+3nM. Assay description: Inhibition of human acetylcholinesterase-I
In DepthDetails ArticlePubMed