BDBM50005553 3-Phenyl-8-aza-bicyclo[3.2.1]octane-2-carboxylic acid methyl ester::CHEMBL368314
SMILES COC(=O)C1C2CC[C@H](C[C@@H]1c1ccccc1)N2
InChI Key InChIKey=JEZUFWYDKGYUCS-IWMBGFJWSA-N
Data  2 IC50
  Tab Delimited (TSV)   2D SDfile   Computed 3D by Vconf -m prep SDfile
Find this compound or compounds like it in BindingDB:
Activity Spreadsheet -- Enzyme Inhibition Constant Data from BindingDB
Found 2 hits for monomerid = 50005553
TargetSodium-dependent dopamine transporter(Rattus norvegicus (rat))
Research Triangle Institute
Curated by ChEMBL
LigandPNGBDBM50005553(3-Phenyl-8-aza-bicyclo[3.2.1]octane-2-carboxylic a...)
Affinity DataIC50:  86nM. Assay description: Inhibition of [3H]cocaine binding to the dopamine transporter.
In DepthDetails ArticlePubMed
TargetSodium-dependent dopamine transporter(Rattus norvegicus (rat))
Research Triangle Institute
Curated by ChEMBL
LigandPNGBDBM50005553(3-Phenyl-8-aza-bicyclo[3.2.1]octane-2-carboxylic a...)
Affinity DataIC50:  360nM. Assay description: Inhibition of [3H]mazindol binding to the dopamine transporter.
In DepthDetails ArticlePubMed