BDBM50005554 3-Benzoyloxy-8-aza-bicyclo[3.2.1]octane-2-carboxylic acid::CHEMBL367502
SMILES OC(=O)C1C2CC[C@H](C[C@@H]1OC(=O)c1ccccc1)N2
InChI Key InChIKey=CMYJDRSCSOXYHG-IGJPJIBNSA-N
Data  2 IC50
  Tab Delimited (TSV)   2D SDfile   Computed 3D by Vconf -m prep SDfile
Find this compound or compounds like it in BindingDB:
Activity Spreadsheet -- Enzyme Inhibition Constant Data from BindingDB
Found 2 hits for monomerid = 50005554
TargetSodium-dependent dopamine transporter(Rattus norvegicus (rat))
Research Triangle Institute
Curated by ChEMBL
LigandPNGBDBM50005554(3-Benzoyloxy-8-aza-bicyclo[3.2.1]octane-2-carboxyl...)
Affinity DataIC50:  7.82E+4nM. Assay description: Inhibition of [3H]cocaine binding to the dopamine transporter.
In DepthDetails ArticlePubMed
TargetSodium-dependent dopamine transporter(Rattus norvegicus (rat))
Research Triangle Institute
Curated by ChEMBL
LigandPNGBDBM50005554(3-Benzoyloxy-8-aza-bicyclo[3.2.1]octane-2-carboxyl...)
Affinity DataIC50:  3.42E+5nM. Assay description: Inhibition of [3H]mazindol binding to the dopamine transporter.
In DepthDetails ArticlePubMed