BDBM50005570 3-(4-Amino-benzoyloxy)-8-methyl-8-aza-bicyclo[3.2.1]octane-2-carboxylic acid methyl ester::CHEMBL175375
SMILES COC(=O)C1C2CC[C@H](C[C@@H]1OC(=O)c1ccc(N)cc1)N2C
InChI Key InChIKey=VGZIPEKHHWAZOW-JLVJUDLZSA-N
Data  2 IC50
  Tab Delimited (TSV)   2D SDfile   Computed 3D by Vconf -m prep SDfile
Find this compound or compounds like it in BindingDB:
Activity Spreadsheet -- Enzyme Inhibition Constant Data from BindingDB
Found 2 hits for monomerid = 50005570
TargetSodium-dependent dopamine transporter(Rattus norvegicus (rat))
Research Triangle Institute
Curated by ChEMBL
LigandPNGBDBM50005570(3-(4-Amino-benzoyloxy)-8-methyl-8-aza-bicyclo[3.2....)
Affinity DataIC50:  1.23E+3nM. Assay description: Potency for the inhibition of [3H]WIN-35428 binding to the dopamine transporter
In DepthDetails ArticlePubMed
TargetSodium-dependent dopamine transporter(Rattus norvegicus (rat))
Research Triangle Institute
Curated by ChEMBL
LigandPNGBDBM50005570(3-(4-Amino-benzoyloxy)-8-methyl-8-aza-bicyclo[3.2....)
Affinity DataIC50:  3.04E+3nM. Assay description: Inhibition of [3H]mazindol binding to the dopamine transporter.
In DepthDetails ArticlePubMed