BDBM50005571 CHEMBL139138::CHEMBL2181429
SMILES CS([O-])(=O)=O.CS([O-])(=O)=O.NC(=O)c1cc[n+](COC[n+]2ccc(\C=N\O)cc2\C=N\O)cc1
InChI Key InChIKey=XLJDHNWDIFYIHX-UHFFFAOYSA-N
Data  3 Kd
  Tab Delimited (TSV)   2D SDfile   Computed 3D by Vconf -m prep SDfile
Find this compound or compounds like it in BindingDB:
Activity Spreadsheet -- Enzyme Inhibition Constant Data from BindingDB
Found 3 hits for monomerid = 50005571
TargetAcetylcholinesterase(Homo sapiens (Human))
University Of Strasburg
Curated by ChEMBL
LigandPNGBDBM50005571(CHEMBL139138 | CHEMBL2181429)
Affinity DataKd:  7.80E+3nM. Assay description: Reactivation of methylphosphonothioate VX-inhibited recombinant human AChE measured up to 10 mins by Ellman's method
In DepthDetails ArticlePubMed
TargetAcetylcholinesterase(Homo sapiens (Human))
University Of Strasburg
Curated by ChEMBL
LigandPNGBDBM50005571(CHEMBL139138 | CHEMBL2181429)
Affinity DataKd:  2.10E+5nM. Assay description: Reactivation of paraoxon-inhibited recombinant human AChE measured up to 10 mins by Ellman's method
In DepthDetails ArticlePubMed
TargetAcetylcholinesterase(Homo sapiens (Human))
University Of Strasburg
Curated by ChEMBL
LigandPNGBDBM50005571(CHEMBL139138 | CHEMBL2181429)
Affinity DataKd:  1.06E+5nM. Assay description: Reactivation of tabun-inhibited recombinant human AChE measured up to 10 mins by Ellman's method
In DepthDetails ArticlePubMed