BDBM50005574 3-Benzoyloxy-8-methyl-8-aza-bicyclo[3.2.1]octane-2-carboxylic acid 2-(4-isothiocyanato-phenyl)-ethyl ester::CHEMBL425854
SMILES CN1[C@@H]2CCC1C([C@H](C2)OC(=O)c1ccccc1)C(=O)OCCc1ccc(cc1)N=C=S
InChI Key InChIKey=YFNOQEKRUIFWNP-NHIVGREZSA-N
Data  2 IC50
  Tab Delimited (TSV)   2D SDfile   Computed 3D by Vconf -m prep SDfile
Find this compound or compounds like it in BindingDB:
Activity Spreadsheet -- Enzyme Inhibition Constant Data from BindingDB
Found 2 hits for monomerid = 50005574
TargetSodium-dependent dopamine transporter(Rattus norvegicus (rat))
Research Triangle Institute
Curated by ChEMBL
LigandPNGBDBM50005574(3-Benzoyloxy-8-methyl-8-aza-bicyclo[3.2.1]octane-2...)
Affinity DataIC50:  196nM. Assay description: Inhibition of [3H]WIN-35248 binding to the dopamine transporter in rat striatal membranes.
In DepthDetails ArticlePubMed
TargetSodium-dependent dopamine transporter(Rattus norvegicus (rat))
Research Triangle Institute
Curated by ChEMBL
LigandPNGBDBM50005574(3-Benzoyloxy-8-methyl-8-aza-bicyclo[3.2.1]octane-2...)
Affinity DataIC50:  196nM. Assay description: Inhibition of [3H]WIN-35428 binding to the dopamine transporter
In DepthDetails ArticlePubMed