BDBM50005591 CHEMBL141807::CHEMBL3234617
SMILES [#8]-c1ccc(cc1)-[#6](=[#7]/c1ccccc1Cl)\c1ccc(-[#8])cc1
InChI Key InChIKey=KCIOZMOTULBIRT-UHFFFAOYSA-N
Data  1 IC50  1 EC50
PDB links: 1 PDB ID matches this monomer.
  Tab Delimited (TSV)   2D SDfile   Computed 3D by Vconf -m prep SDfile
Find this compound or compounds like it in BindingDB:
Activity Spreadsheet -- Enzyme Inhibition Constant Data from BindingDB
Found 2 hits for monomerid = 50005591
TargetEstrogen receptor(Homo sapiens (Human))
Key Laboratory Of Combinatorial Biosynthesis And Drug Discovery (Wuhan University)
Curated by ChEMBL
LigandPNGBDBM50005591(CHEMBL141807 | CHEMBL3234617)
Affinity DataEC50:  1nM. Assay description: Agonist activity at ERalpha (unknown origin) expressed in human HepG2 cells assessed as transcriptional activation after 24 hrs by ERE-luciferase rep...
TargetEstrogen receptor beta(Homo sapiens (Human))
Key Laboratory Of Combinatorial Biosynthesis And Drug Discovery (Wuhan University)
Curated by ChEMBL
LigandPNGBDBM50005591(CHEMBL141807 | CHEMBL3234617)
Affinity DataIC50:  19nM. Assay description: Antagonist activity at ERbeta (unknown origin) expressed in human HepG2 cells assessed as inhibition of 17beta-estradiol-induced transcriptional acti...
In DepthDetails ArticlePubMed