BDBM50005630 CHEMBL3235050
SMILES CCCCOc1cc(OCCCN(CC)CC)ccc1NC(=O)c1cc(nn1C)-c1ccc(Oc2ccccc2)cc1
InChI Key InChIKey=RBQFJWHBUCVSCF-UHFFFAOYSA-N
Data  1 IC50
  Tab Delimited (TSV)   2D SDfile   Computed 3D by Vconf -m prep SDfile
Find this compound or compounds like it in BindingDB:
Activity Spreadsheet -- Enzyme Inhibition Constant Data from BindingDB
Found 1 hit for monomerid = 50005630
TargetAdvanced glycosylation end product-specific receptor(Homo sapiens (Human))
Woosuk University
Curated by ChEMBL
LigandPNGBDBM50005630(CHEMBL3235050)
Affinity DataIC50:  5.40E+3nM. Assay description: Inhibition of biotinylated human RAGE assessed as bound amyloid beta level after 60 mins by ELISA
In DepthDetails ArticlePubMed