BDBM50005697 CHEMBL3085539::{1-[1-Benzyl-3-(2-tert-butylcarbamoyl-pyrrolidin-1-yl)-2-hydroxy-3-oxo-propylcarbamoyl]-2-methyl-propyl}-carbamic acid benzyl ester
SMILES CC(C)[C@H](NC(=O)OCc1ccccc1)C(=O)N[C@@H](Cc1ccccc1)[C@H](O)C(=O)N1CCC[C@@H]1C(=O)NC(C)(C)C
InChI Key InChIKey=VKJFDINBGLGOFB-XUJYPJAKSA-N
Data  1 IC50
  Tab Delimited (TSV)   2D SDfile   Computed 3D by Vconf -m prep SDfile
Find this compound or compounds like it in BindingDB:
Activity Spreadsheet -- Enzyme Inhibition Constant Data from BindingDB
Found 1 hit for monomerid = 50005697
TargetGag-Pol polyprotein [489-587](Human immunodeficiency virus type 1)
Washington University
Curated by ChEMBL
LigandPNGBDBM50005697(CHEMBL3085539 | {1-[1-Benzyl-3-(2-tert-butylcarbam...)
Affinity DataIC50:  4.30nM. Assay description: Inhibitory potency against HIV-1 protease
In DepthDetails ArticlePubMed