BDBM50005729 2-{4-[4-(2,4-Diamino-6-oxo-1,6-dihydro-pyrimidin-5-yl)-butylamino]-benzoylamino}-pentanedioic acid::CHEMBL30364
SMILES Nc1nc(N)c(CCCCNc2ccc(cc2)C(=O)NC(CCC(O)=O)C(O)=O)c(=O)[nH]1
InChI Key InChIKey=PRFWJWXSGBDTCD-UHFFFAOYSA-N
Data  1 IC50
  Tab Delimited (TSV)   2D SDfile   Computed 3D by Vconf -m prep SDfile
Find this compound or compounds like it in BindingDB:
Activity Spreadsheet -- Enzyme Inhibition Constant Data from BindingDB
Found 1 hit for monomerid = 50005729
TargetTrifunctional purine biosynthetic protein adenosine-3(Homo sapiens (Human))
Wellcome Research Laboratories
Curated by ChEMBL
LigandPNGBDBM50005729(2-{4-[4-(2,4-Diamino-6-oxo-1,6-dihydro-pyrimidin-5...)
Affinity DataIC50:  1.82E+4nM. Assay description: In vitro inhibition of hog liver GAR transformylase with (6R)-10-formyl-FH4 as cofactor
In DepthDetails ArticlePubMed