BDBM50005738 2-{4-[3-(3-Amino-5-oxo-2,5-dihydro-[1,2,4]triazin-6-yl)-2-oxo-pyrrolidin-1-yl]-benzoylamino}-pentanedioic acid::CHEMBL31107
SMILES Nc1nnc(C2CCN(C2=O)c2ccc(cc2)C(=O)NC(CCC(O)=O)C(O)=O)c(=O)[nH]1
InChI Key InChIKey=BPPDXEYNAGIVIS-UHFFFAOYSA-N
Data  1 IC50
  Tab Delimited (TSV)   2D SDfile   Computed 3D by Vconf -m prep SDfile
Find this compound or compounds like it in BindingDB:
Activity Spreadsheet -- Enzyme Inhibition Constant Data from BindingDB
Found 1 hit for monomerid = 50005738
TargetTrifunctional purine biosynthetic protein adenosine-3(Homo sapiens (Human))
Wellcome Research Laboratories
Curated by ChEMBL
LigandPNGBDBM50005738(2-{4-[3-(3-Amino-5-oxo-2,5-dihydro-[1,2,4]triazin-...)
Affinity DataIC50: >1.00E+5nM. Assay description: In vitro inhibition of hog liver GAR transformylase with (6R)-10-formyl-FH4 as cofactor
In DepthDetails ArticlePubMed