BDBM50005798 2,8-Diamino-3-benzyl-1,9-dihydro-purin-6-one::CHEMBL285258
SMILES Nc1nc2c(O)nc(N)n(Cc3ccccc3)c2n1
InChI Key InChIKey=SRPGJFRQZCSAKY-UHFFFAOYSA-N
Data  1 IC50
  Tab Delimited (TSV)   2D SDfile   Computed 3D by Vconf -m prep SDfile
Find this compound or compounds like it in BindingDB:
Activity Spreadsheet -- Enzyme Inhibition Constant Data from BindingDB
Found 1 hit for monomerid = 50005798
TargetPurine nucleoside phosphorylase(Homo sapiens (Human))
Warner-Lambert
Curated by ChEMBL
LigandPNGBDBM50005798(2,8-Diamino-3-benzyl-1,9-dihydro-purin-6-one | CHE...)
Affinity DataIC50:  5.00E+3nM. Assay description: Inhibitory activity against Purine nucleoside phosphorylase evaluated by radiochemical assay
In DepthDetails ArticlePubMed