BDBM50005802 2,8-Diamino-9-furan-2-ylmethyl-1,9-dihydro-purin-6-one::CHEMBL33189
SMILES Nc1nc2c(nc(N)[nH]c2=O)n1Cc1ccco1
InChI Key InChIKey=QKDLJUSXYAHDFI-UHFFFAOYSA-N
Data  1 IC50
  Tab Delimited (TSV)   2D SDfile   Computed 3D by Vconf -m prep SDfile
Find this compound or compounds like it in BindingDB:
Activity Spreadsheet -- Enzyme Inhibition Constant Data from BindingDB
Found 1 hit for monomerid = 50005802
TargetPurine nucleoside phosphorylase(Homo sapiens (Human))
Warner-Lambert
Curated by ChEMBL
LigandPNGBDBM50005802(2,8-Diamino-9-furan-2-ylmethyl-1,9-dihydro-purin-6...)
Affinity DataIC50:  250nM. Assay description: Inhibitory activity against Purine nucleoside phosphorylase evaluated by radiochemical assay
In DepthDetails ArticlePubMed