BDBM50005824 CHEMBL288037::[1-[(Acetyl-phenethyl-amino)-methyl]-2-(1H-indol-3-yl)-1-methyl-ethyl]-carbamic acid adamantan-2-yl ester;0.25H2O
SMILES CC(=O)N(CCc1ccccc1)CC(C)(Cc1c[nH]c2ccccc12)NC(=O)OC1[C@H]2C[C@@H]3C[C@@H](C[C@H]1C3)C2
InChI Key InChIKey=TVCQIULPKPJAHS-YZYRQLBWSA-N
Data  2 IC50
  Tab Delimited (TSV)   2D SDfile   Computed 3D by Vconf -m prep SDfile
Find this compound or compounds like it in BindingDB:
Activity Spreadsheet -- Enzyme Inhibition Constant Data from BindingDB
Found 2 hits for monomerid = 50005824
TargetCholecystokinin receptor type A(RAT)
Parke-Davis Neuroscience Research Center
Curated by ChEMBL
LigandPNGBDBM50005824(CHEMBL288037 | [1-[(Acetyl-phenethyl-amino)-methyl...)
Affinity DataIC50:  1.06E+3nM. Assay description: Inhibition of [125I]CCK-8 binding to Cholecystokinin type A receptor in the rat pancreas
In DepthDetails ArticlePubMed
TargetGastrin/cholecystokinin type B receptor(MOUSE)
Parke-Davis Neuroscience Research Center
Curated by ChEMBL
LigandPNGBDBM50005824(CHEMBL288037 | [1-[(Acetyl-phenethyl-amino)-methyl...)
Affinity DataIC50:  1.31E+3nM. Assay description: Inhibition of [125I]CCK-8 binding to cholecystokinin type B receptor in the mouse cerebral cortex
In DepthDetails ArticlePubMed