BDBM50005909 1-Hydroxy-8-methoxy-2-methyl-anthraquinone::CHEMBL40192
SMILES COc1cccc2C(=O)c3ccc(C)c(O)c3C(=O)c12
InChI Key InChIKey=NGMVQANAAHWVBH-UHFFFAOYSA-N
Data  1 IC50
  Tab Delimited (TSV)   2D SDfile   Computed 3D by Vconf -m prep SDfile
Find this compound or compounds like it in BindingDB:
Activity Spreadsheet -- Enzyme Inhibition Constant Data from BindingDB
Found 1 hit for monomerid = 50005909
TargetNeutrophil elastase(Homo sapiens (Human))
Georgia Institute Of Technology
Curated by ChEMBL
LigandPNGBDBM50005909(1-Hydroxy-8-methoxy-2-methyl-anthraquinone | CHEMB...)
Affinity DataIC50:  1.90E+4nM. Assay description: In vitro inhibition of human leukocyte elastase.
In DepthDetails ArticlePubMed