BDBM50005918 2,6-Diamino-7-furan-2-ylmethyl-3,5-dihydro-pyrrolo[3,2-d]pyrimidin-4-one::CHEMBL38998
SMILES Nc1[nH]c2c(nc(N)[nH]c2=O)c1Cc1ccco1
InChI Key InChIKey=CTDMAIGDJQOLRG-UHFFFAOYSA-N
Data  1 IC50
  Tab Delimited (TSV)   2D SDfile   Computed 3D by Vconf -m prep SDfile
Find this compound or compounds like it in BindingDB:
Activity Spreadsheet -- Enzyme Inhibition Constant Data from BindingDB
Found 1 hit for monomerid = 50005918
TargetPurine nucleoside phosphorylase(Homo sapiens (Human))
Warner-Lambert
Curated by ChEMBL
LigandPNGBDBM50005918(2,6-Diamino-7-furan-2-ylmethyl-3,5-dihydro-pyrrolo...)
Affinity DataIC50:  5.40E+3nM. Assay description: Compound was tested for the inhibitory activity against purine nucleoside phosphorylase (PNP)
In DepthDetails ArticlePubMed