BDBM50005936 4-Methoxy-3-octadec-9-enoylamino-benzoic acid methyl ester::CHEMBL40781
SMILES CCCCCCCC\C=C\CCCCCCCC(=O)Nc1cc(ccc1OC)C(=O)OC
InChI Key InChIKey=PADORSBNKGPFCT-VAWYXSNFSA-N
Data  1 IC50
  Tab Delimited (TSV)   2D SDfile   Computed 3D by Vconf -m prep SDfile
Find this compound or compounds like it in BindingDB:
Activity Spreadsheet -- Enzyme Inhibition Constant Data from BindingDB
Found 1 hit for monomerid = 50005936
TargetAcyl-CoA:cholesterol acyltransferase(Oryctolagus cuniculus)
Warner-Lambert
Curated by ChEMBL
LigandPNGBDBM50005936(4-Methoxy-3-octadec-9-enoylamino-benzoic acid meth...)
Affinity DataIC50:  430nM. Assay description: In vitro inhibition of acyl coenzyme A:cholesterol acyltransferase, in intestinal microsomes isolated from cholesterol-fed rabbits
In DepthDetails ArticlePubMed