BDBM50005951 CHEMBL442157::Octadec-9-enoic acid (2,4,6-trimethyl-phenyl)-amide
SMILES CCCCCCCC\C=C\CCCCCCCC(=O)Nc1c(C)cc(C)cc1C
InChI Key InChIKey=GHJRWTPGZUEMMK-OUKQBFOZSA-N
Data  1 IC50
  Tab Delimited (TSV)   2D SDfile   Computed 3D by Vconf -m prep SDfile
Find this compound or compounds like it in BindingDB:
Activity Spreadsheet -- Enzyme Inhibition Constant Data from BindingDB
Found 1 hit for monomerid = 50005951
TargetAcyl-CoA:cholesterol acyltransferase(Oryctolagus cuniculus)
Warner-Lambert
Curated by ChEMBL
LigandPNGBDBM50005951(CHEMBL442157 | Octadec-9-enoic acid (2,4,6-trimeth...)
Affinity DataIC50:  700nM. Assay description: In vitro inhibition of acyl coenzyme A:cholesterol acyltransferase, in intestinal microsomes isolated from cholesterol-fed rabbits
In DepthDetails ArticlePubMed