BDBM50005962 2,2-Dimethyl-dodecanoic acid (2,6-diisopropyl-phenyl)-amide::CHEMBL289062
SMILES CCCCCCCCCCC(C)(C)C(=O)Nc1c(cccc1C(C)C)C(C)C
InChI Key InChIKey=WABKFWFSIUGIOD-UHFFFAOYSA-N
Data  1 IC50
  Tab Delimited (TSV)   2D SDfile   Computed 3D by Vconf -m prep SDfile
Find this compound or compounds like it in BindingDB:
Activity Spreadsheet -- Enzyme Inhibition Constant Data from BindingDB
Found 1 hit for monomerid = 50005962
TargetAcyl-CoA:cholesterol acyltransferase(Oryctolagus cuniculus)
Warner-Lambert
Curated by ChEMBL
LigandPNGBDBM50005962(2,2-Dimethyl-dodecanoic acid (2,6-diisopropyl-phen...)
Affinity DataIC50:  210nM. Assay description: In vitro inhibition of acyl coenzyme A:cholesterol acyltransferase, in intestinal microsomes isolated from cholesterol-fed rabbits
In DepthDetails ArticlePubMed