BDBM50006002 3-[3-({3-[2-(2-Decyloxy-ethoxy)-ethoxy]-2-methoxy-propoxy}-hydroxy-phosphoryloxy)-benzyl]-5-methyl-thiazol-3-ium::CHEMBL46972
SMILES CCCCCCCCCCOCCOCCOCC(COP([O-])(=O)Oc1cccc(C[n+]2csc(C)c2)c1)OC
InChI Key InChIKey=FAKOMTPQVSFQKE-UHFFFAOYSA-N
Data  1 IC50
  Tab Delimited (TSV)   2D SDfile   Computed 3D by Vconf -m prep SDfile
Find this compound or compounds like it in BindingDB:
Activity Spreadsheet -- Enzyme Inhibition Constant Data from BindingDB
Found 1 hit for monomerid = 50006002
TargetPlatelet-activating factor receptor(Cavia porcellus)
American Cyanamid
Curated by ChEMBL
LigandPNGBDBM50006002(3-[3-({3-[2-(2-Decyloxy-ethoxy)-ethoxy]-2-methoxy-...)
Affinity DataIC50:  4.05E+3nM. Assay description: Inhibition of PAF induced platelet aggregation in rabbit
In DepthDetails ArticlePubMed