BDBM50006006 3-{3-[(3-Acetyl-5-tetradecyloxy-phenoxy)-hydroxy-phosphoryloxy]-benzyl}-5-methyl-thiazol-3-ium::CHEMBL297797
SMILES CCCCCCCCCCCCCCOc1cc(OP([O-])(=O)Oc2cccc(C[n+]3csc(C)c3)c2)cc(c1)C(C)=O
InChI Key InChIKey=ZMMWKLRFPABEDI-UHFFFAOYSA-N
Data  1 IC50
  Tab Delimited (TSV)   2D SDfile   Computed 3D by Vconf -m prep SDfile
Find this compound or compounds like it in BindingDB:
Activity Spreadsheet -- Enzyme Inhibition Constant Data from BindingDB
Found 1 hit for monomerid = 50006006
TargetPlatelet-activating factor receptor(Cavia porcellus)
American Cyanamid
Curated by ChEMBL
LigandPNGBDBM50006006(3-{3-[(3-Acetyl-5-tetradecyloxy-phenoxy)-hydroxy-p...)
Affinity DataIC50:  2.62E+3nM. Assay description: Inhibition of PAF induced platelet aggregation in rabbit
In DepthDetails ArticlePubMed