BDBM50006033 3-{3-[(3-Hexadecyloxy-2-methoxy-propoxy)-hydroxy-phosphoryloxy]-benzyl}-5-methyl-thiazol-3-ium::CHEMBL44995
SMILES CCCCCCCCCCCCCCCCOCC(COP([O-])(=O)Oc1cccc(C[n+]2csc(C)c2)c1)OC
InChI Key InChIKey=IWESUVBSCLQSSW-UHFFFAOYSA-N
Data  1 IC50
  Tab Delimited (TSV)   2D SDfile   Computed 3D by Vconf -m prep SDfile
Find this compound or compounds like it in BindingDB:
Activity Spreadsheet -- Enzyme Inhibition Constant Data from BindingDB
Found 1 hit for monomerid = 50006033
TargetPlatelet-activating factor receptor(Cavia porcellus)
American Cyanamid
Curated by ChEMBL
LigandPNGBDBM50006033(3-{3-[(3-Hexadecyloxy-2-methoxy-propoxy)-hydroxy-p...)
Affinity DataIC50:  680nM. Assay description: Inhibition of PAF induced platelet aggregation in rabbit
In DepthDetails ArticlePubMed