BDBM50006052 3-{3-[Hydroxy-(3-methoxy-4-tetradecyloxy-phenoxy)-phosphoryloxy]-benzyl}-5-methyl-thiazol-3-ium::CHEMBL290038
SMILES CCCCCCCCCCCCCCOc1ccc(OP([O-])(=O)Oc2cccc(C[n+]3csc(C)c3)c2)cc1OC
InChI Key InChIKey=IWODBQBRBRSASQ-UHFFFAOYSA-N
Data  1 IC50
  Tab Delimited (TSV)   2D SDfile   Computed 3D by Vconf -m prep SDfile
Find this compound or compounds like it in BindingDB:
Activity Spreadsheet -- Enzyme Inhibition Constant Data from BindingDB
Found 1 hit for monomerid = 50006052
TargetPlatelet-activating factor receptor(Cavia porcellus)
American Cyanamid
Curated by ChEMBL
LigandPNGBDBM50006052(3-{3-[Hydroxy-(3-methoxy-4-tetradecyloxy-phenoxy)-...)
Affinity DataIC50:  1.84E+3nM. Assay description: Inhibition of PAF induced platelet aggregation in rabbit
In DepthDetails ArticlePubMed