BDBM50006067 3-{3-[(4-Benzyloxy-phenoxy)-hydroxy-phosphoryloxy]-benzyl}-5-methyl-thiazol-3-ium::CHEMBL47199
SMILES Cc1c[n+](Cc2cccc(OP([O-])(=O)Oc3ccc(OCc4ccccc4)cc3)c2)cs1
InChI Key InChIKey=GWFNNTQCECUDFY-UHFFFAOYSA-N
Data  1 IC50
  Tab Delimited (TSV)   2D SDfile   Computed 3D by Vconf -m prep SDfile
Find this compound or compounds like it in BindingDB:
Activity Spreadsheet -- Enzyme Inhibition Constant Data from BindingDB
Found 1 hit for monomerid = 50006067
TargetPlatelet-activating factor receptor(Cavia porcellus)
American Cyanamid
Curated by ChEMBL
LigandPNGBDBM50006067(3-{3-[(4-Benzyloxy-phenoxy)-hydroxy-phosphoryloxy]...)
Affinity DataIC50:  5.40E+4nM. Assay description: Inhibition of PAF induced platelet aggregation in rabbit
In DepthDetails ArticlePubMed