BDBM50006094 3-{2-[(2,5-Di-tert-butyl-4-dodecyloxy-phenoxy)-hydroxy-phosphoryloxy]-benzyl}-5-methyl-thiazol-3-ium::CHEMBL297375
SMILES CCCCCCCCCCCCOc1cc(c(OP([O-])(=O)Oc2ccccc2C[n+]2csc(C)c2)cc1C(C)(C)C)C(C)(C)C
InChI Key InChIKey=UHTXJUDQQHYRTM-UHFFFAOYSA-N
Data  1 IC50
  Tab Delimited (TSV)   2D SDfile   Computed 3D by Vconf -m prep SDfile
Find this compound or compounds like it in BindingDB:
Activity Spreadsheet -- Enzyme Inhibition Constant Data from BindingDB
Found 1 hit for monomerid = 50006094
TargetPlatelet-activating factor receptor(Cavia porcellus)
American Cyanamid
Curated by ChEMBL
LigandPNGBDBM50006094(3-{2-[(2,5-Di-tert-butyl-4-dodecyloxy-phenoxy)-hyd...)
Affinity DataIC50:  6.52E+3nM. Assay description: Inhibition of PAF induced platelet aggregation in rabbit
In DepthDetails ArticlePubMed