BDBM50006099 1-{3-[Hydroxy-(2-methoxy-3-tetradecyloxy-phenoxy)-phosphoryloxy]-benzyl}-quinolinium::CHEMBL47760
SMILES CCCCCCCCCCCCCCOc1cccc(OP([O-])(=O)Oc2cccc(C[n+]3cccc4ccccc34)c2)c1OC
InChI Key InChIKey=YTKRNIZIAMSMKZ-UHFFFAOYSA-N
Data  1 IC50
  Tab Delimited (TSV)   2D SDfile   Computed 3D by Vconf -m prep SDfile
Find this compound or compounds like it in BindingDB:
Activity Spreadsheet -- Enzyme Inhibition Constant Data from BindingDB
Found 1 hit for monomerid = 50006099
TargetPlatelet-activating factor receptor(Cavia porcellus)
American Cyanamid
Curated by ChEMBL
LigandPNGBDBM50006099(1-{3-[Hydroxy-(2-methoxy-3-tetradecyloxy-phenoxy)-...)
Affinity DataIC50:  1.99E+3nM. Assay description: Inhibition of PAF induced platelet aggregation in rabbit
In DepthDetails ArticlePubMed