BDBM500061 US11021457, Compound 65
SMILES O[C@H]1C[C@H](N(CCNC=C2C(=O)CC(CC2=O)c2ccccc2)C1)C(=O)Nc1cccc2C(=O)N(Cc12)C1CCC(=O)NC1=O
InChI Key InChIKey=RQYCDBGTXQUMKG-BZBNNRNISA-N
Data  1 IC50
  Tab Delimited (TSV)   2D SDfile   Computed 3D by Vconf -m prep SDfile
Find this compound or compounds like it in BindingDB:
Activity Spreadsheet -- Enzyme Inhibition Constant Data from BindingDB
Found 1 hit for monomerid = 500061
TargetMicrotubule-associated proteins 1A/1B light chain 3B(Human)
Wigen Biomedicine Technology (Shanghai)
US Patent
LigandPNGBDBM500061(US11021457, Compound 65)
Affinity DataIC50:  275nM. Assay description: By constructing a prokaryotic expression system, the LC3B protein was successfully expressed and purified, and a preliminary screening and verificati...
Ligand InfoPC cidPC sid
In DepthDetails US Patent