BDBM50006164 2-[1-(1-Cyclohexylmethyl-2,3-dihydroxy-5-methyl-hexylcarbamoyl)-ethoxy]-N-ethyl-3-phenyl-propionamide::CHEMBL432133
SMILES CCNC(=O)[C@H](Cc1ccccc1)O[C@@H](C)C(=O)N[C@@H](CC1CCCCC1)[C@@H](O)[C@@H](O)CC(C)C
InChI Key InChIKey=JJBDIVLVJYMPCP-KLSDWBHSSA-N
Data  1 IC50
  Tab Delimited (TSV)   2D SDfile   Computed 3D by Vconf -m prep SDfile
Find this compound or compounds like it in BindingDB:
Activity Spreadsheet -- Enzyme Inhibition Constant Data from BindingDB
Found 1 hit for monomerid = 50006164
TargetRenin(Homo sapiens (Human))
Abbott Laboratories
Curated by ChEMBL
LigandPNGBDBM50006164(2-[1-(1-Cyclohexylmethyl-2,3-dihydroxy-5-methyl-he...)
Affinity DataIC50:  130nMpH: 7.4Assay Description:In vitro potency against purified renin at a pH of 6.0.
In DepthDetails ArticlePubMed