BDBM50006166 2-{1-Benzyl-2-[4-(2-methoxy-ethoxy)-piperidin-1-yl]-2-oxo-ethylamino}-hexanoic acid (1-cyclohexylmethyl-2,3-dihydroxy-5-methyl-hexyl)-amide::CHEMBL301985
SMILES CCCC[C@H](N[C@@H](Cc1ccccc1)C(=O)N1CCC(CC1)OCCOC)C(=O)N[C@@H](CC1CCCCC1)[C@@H](O)[C@@H](O)CC(C)C
InChI Key InChIKey=LUOIHJHGWSMHST-PRTBYXSSSA-N
Data  2 IC50
  Tab Delimited (TSV)   2D SDfile   Computed 3D by Vconf -m prep SDfile
Find this compound or compounds like it in BindingDB:
Activity Spreadsheet -- Enzyme Inhibition Constant Data from BindingDB
Found 2 hits for monomerid = 50006166
TargetRenin(Homo sapiens (Human))
Abbott Laboratories
Curated by ChEMBL
LigandPNGBDBM50006166(2-{1-Benzyl-2-[4-(2-methoxy-ethoxy)-piperidin-1-yl...)
Affinity DataIC50:  1.80E+3nMpH: 7.4Assay Description:In vitro potency against plasma renin at a pH of 7.4
In DepthDetails ArticlePubMed
TargetRenin(Homo sapiens (Human))
Abbott Laboratories
Curated by ChEMBL
LigandPNGBDBM50006166(2-{1-Benzyl-2-[4-(2-methoxy-ethoxy)-piperidin-1-yl...)
Affinity DataIC50:  31nMpH: 7.4Assay Description:In vitro potency against purified renin at a pH of 6.0.
In DepthDetails ArticlePubMed