BDBM50006201 CHEMBL48722::{4-[2-(2-tert-Butoxycarbonylamino-3-phenyl-propionylamino)-3-(1H-imidazol-4-yl)-propionylamino]-5-cyclohexyl-3-hydroxy-1-isopropyl-pentyl}-carbamic acid 3-dimethylamino-propyl ester
SMILES CC(C)[C@H](C[C@H](O)[C@H](CC1CCCCC1)NC(=O)[C@H](Cc1cnc[nH]1)NC(=O)[C@H](Cc1ccccc1)NC(=O)OC(C)(C)C)NC(=O)OCCCN(C)C
InChI Key InChIKey=XDRYTUHSOPGYMQ-ZZTWKDBPSA-N
Data  2 IC50
  Tab Delimited (TSV)   2D SDfile   Computed 3D by Vconf -m prep SDfile
Find this compound or compounds like it in BindingDB:
Activity Spreadsheet -- Enzyme Inhibition Constant Data from BindingDB
Found 2 hits for monomerid = 50006201
TargetRenin(Homo sapiens (Human))
Abbott Laboratories
Curated by ChEMBL
LigandPNGBDBM50006201(CHEMBL48722 | {4-[2-(2-tert-Butoxycarbonylamino-3-...)
Affinity DataIC50:  17nMpH: 7.4Assay Description:In vitro potency against human plasma renin at a pH of 7.4
In DepthDetails ArticlePubMed
TargetRenin(Homo sapiens (Human))
Abbott Laboratories
Curated by ChEMBL
LigandPNGBDBM50006201(CHEMBL48722 | {4-[2-(2-tert-Butoxycarbonylamino-3-...)
Affinity DataIC50:  2.80nMpH: 6.0Assay Description:In vitro activity against human renin (pH 6.0)
In DepthDetails ArticlePubMed