BDBM50006225 3-(4-Azido-3-iodo-phenyl)-8-methyl-8-aza-bicyclo[3.2.1]octane-2-carboxylic acid methyl ester
SMILES COC(=O)[C@@H]1C2CCC(C[C@@H]1c1ccc(N=[N+]=[N-])c(I)c1)N2C
InChI Key InChIKey=KHVIZTSKUUXZHP-XNSJETLRSA-N
Data  1 IC50
  Tab Delimited (TSV)   2D SDfile   Computed 3D by Vconf -m prep SDfile
Find this compound or compounds like it in BindingDB:
Activity Spreadsheet -- Enzyme Inhibition Constant Data from BindingDB
Found 1 hit for monomerid = 50006225
TargetSodium-dependent dopamine transporter(Rattus norvegicus (rat))
Research Triangle Institute
Curated by ChEMBL
LigandPNGBDBM50006225(3-(4-Azido-3-iodo-phenyl)-8-methyl-8-aza-bicyclo[3...)
Affinity DataIC50:  4.90nM. Assay description: Inhibition of [3H]WIN-35248 binding to the dopamine transporter in rat striatal membranes.
In DepthDetails ArticlePubMed