BDBM50006309 6-Carboxymethyl-12-(3-guanidino-propyl)-15-hydroxymethyl-5,8,11,14,17-pentaoxo-1-thia-4,7,10,13,16-pentaaza-cyclooctadecane-3-carboxylic acid::CHEMBL64446
SMILES NC(=N)NCCC[C@@H]1NC(=O)[C@@H](CO)NC(=O)CSC[C@H](NC(=O)[C@H](CC(O)=O)NC(=O)CNC1=O)C(O)=O
InChI Key InChIKey=JTZFJPHPFSHXBE-YFKTTZPYSA-N
Data  1 IC50
  Tab Delimited (TSV)   2D SDfile   Computed 3D by Vconf -m prep SDfile
Find this compound or compounds like it in BindingDB:
Activity Spreadsheet -- Enzyme Inhibition Constant Data from BindingDB
Found 1 hit for monomerid = 50006309
TargetIntegrin alpha-IIb/beta-3(Homo sapiens (Human))
Genentech
Curated by ChEMBL
LigandPNGBDBM50006309(6-Carboxymethyl-12-(3-guanidino-propyl)-15-hydroxy...)
Affinity DataIC50:  22nM. Assay description: The compound was tested for the inhibition of fibrinogen receptor
In DepthDetails ArticlePubMed