BDBM50006347 2-(2-{2-[2-(2-Acetylamino-acetylamino)-5-guanidino-pentanoylamino]-acetylamino}-3-carboxy-propionylamino)-3-methyl-butyric acid::CHEMBL62519
SMILES CC(C)[C@H](NC(=O)[C@H](CC(O)=O)NC(=O)CNC(=O)[C@H](CCCNC(N)=N)NC(=O)CNC(C)=O)C(O)=O
InChI Key InChIKey=ISSFWLVXRAXPAT-DCGLDWPTSA-N
Data  2 IC50
  Tab Delimited (TSV)   2D SDfile   Computed 3D by Vconf -m prep SDfile
Find this compound or compounds like it in BindingDB:
Activity Spreadsheet -- Enzyme Inhibition Constant Data from BindingDB
Found 2 hits for monomerid = 50006347
TargetIntegrin alpha-IIb/beta-3(Homo sapiens (Human))
Genentech
Curated by ChEMBL
LigandPNGBDBM50006347(2-(2-{2-[2-(2-Acetylamino-acetylamino)-5-guanidino...)
Affinity DataIC50:  12nM. Assay description: The compound was tested for the inhibition of fibrinogen receptor
In DepthDetails ArticlePubMed
TargetIntegrin alpha-IIb/beta-3(Homo sapiens (Human))
Genentech
Curated by ChEMBL
LigandPNGBDBM50006347(2-(2-{2-[2-(2-Acetylamino-acetylamino)-5-guanidino...)
Affinity DataIC50:  7.70E+4nM. Assay description: Inhibition of ADP-induced platelet aggregation in human platelet-rich plasma
In DepthDetails ArticlePubMed