BDBM50006385 (2Z)-2-imino-3'-methyl-1'H,5H-spiro[imidazolidine-4,4'-quinazoline]-2',5(3'H)-dione::CHEMBL63639
SMILES CN1C(=O)Nc2ccccc2C11N=C(N)NC1=O
InChI Key InChIKey=LKJABOURHOWWKL-UHFFFAOYSA-N
Data  1 IC50
  Tab Delimited (TSV)   2D SDfile   Computed 3D by Vconf -m prep SDfile
Find this compound or compounds like it in BindingDB:
Activity Spreadsheet -- Enzyme Inhibition Constant Data from BindingDB
Found 1 hit for monomerid = 50006385
TargetAldo-keto reductase family 1 member B1(Homo sapiens (Human))
Tanabe Seiyaku
Curated by ChEMBL
LigandPNGBDBM50006385((2Z)-2-imino-3'-methyl-1'H,5H-spiro[imidazolidine-...)
Affinity DataIC50: >1.00E+5nM. Assay description: Tested in vitro for inhibitory activity against partially purified aldose reductase from male rabbit lens
In DepthDetails ArticlePubMed