BDBM50006400 1,3'-dimethyl-1'H,2H,5H-spiro[imidazolidine-4,4'-quinazoline]-2,2',5(3'H)-trione::CHEMBL67065
SMILES CN1C(=O)NC2(N(C)C(=O)Nc3ccccc23)C1=O
InChI Key InChIKey=BVHCEVFMOQMYCD-UHFFFAOYSA-N
Data  1 IC50
  Tab Delimited (TSV)   2D SDfile   Computed 3D by Vconf -m prep SDfile
Find this compound or compounds like it in BindingDB:
Activity Spreadsheet -- Enzyme Inhibition Constant Data from BindingDB
Found 1 hit for monomerid = 50006400
TargetAldo-keto reductase family 1 member B1(Homo sapiens (Human))
Tanabe Seiyaku
Curated by ChEMBL
LigandPNGBDBM50006400(1,3'-dimethyl-1'H,2H,5H-spiro[imidazolidine-4,4'-q...)
Affinity DataIC50: >1.00E+5nM. Assay description: Tested in vitro for inhibitory activity against partially purified aldose reductase from male rabbit lens
In DepthDetails ArticlePubMed