BDBM50006425 CHEMBL303322::{1-[1-[1-Cyclohexylmethyl-2-hydroxy-3-(pyridin-2-ylsulfanyl)-propylcarbamoyl]-2-(1H-imidazol-4-yl)-ethylcarbamoyl]-2-phenyl-ethyl}-carbamic acid tert-butyl ester
SMILES CC(C)(C)OC(=O)N[C@@H](Cc1ccccc1)C(=O)N[C@@H](Cc1cnc[nH]1)C(=O)N[C@@H](CC1CCCCC1)[C@@H](O)CSc1ccccn1
InChI Key InChIKey=BVZQIUZSCHYLLR-KRCBVYEFSA-N
Data  1 IC50
  Tab Delimited (TSV)   2D SDfile   Computed 3D by Vconf -m prep SDfile
Find this compound or compounds like it in BindingDB:
Activity Spreadsheet -- Enzyme Inhibition Constant Data from BindingDB
Found 1 hit for monomerid = 50006425
TargetRenin(Homo sapiens (Human))
Merck Sharp & Dohme Research Laboratories
Curated by ChEMBL
LigandPNGBDBM50006425(CHEMBL303322 | {1-[1-[1-Cyclohexylmethyl-2-hydroxy...)
Affinity DataIC50:  198nM. Assay description: The compound was tested in vitro for inhibition of human plasma renin.
In DepthDetails ArticlePubMed