BDBM50006461 CHEMBL66006::[3-(4-Bromo-2-fluoro-benzyl)-4-oxo-3,4,5,6,7,8-hexahydro-phthalazin-1-yl]-acetic acid
SMILES OC(=O)Cc1nn(Cc2ccc(Br)cc2F)c(=O)c2CCCCc12
InChI Key InChIKey=IMQKCRFXBQXONP-UHFFFAOYSA-N
Data  1 IC50
  Tab Delimited (TSV)   2D SDfile   Computed 3D by Vconf -m prep SDfile
Find this compound or compounds like it in BindingDB:
Activity Spreadsheet -- Enzyme Inhibition Constant Data from BindingDB
Found 1 hit for monomerid = 50006461
TargetAldo-keto reductase family 1 member B1(Homo sapiens (Human))
Pfizer
Curated by ChEMBL
LigandPNGBDBM50006461(CHEMBL66006 | [3-(4-Bromo-2-fluoro-benzyl)-4-oxo-3...)
Affinity DataIC50:  32nM. Assay description: Inhibitory activity against aldose reductase isolated from human placenta
In DepthDetails ArticlePubMed