BDBM50006486 (5,6-Dichloro-4-hydroxy-2,2-dimethyl-chroman-4-yl)-acetic acid::CHEMBL73395
SMILES CC1(C)C[C@@](O)(CC(O)=O)c2c(Cl)c(Cl)ccc2O1
InChI Key InChIKey=DNKZZHMXQUVUBS-ZDUSSCGKSA-N
Data  1 IC50
  Tab Delimited (TSV)   2D SDfile   Computed 3D by Vconf -m prep SDfile
Find this compound or compounds like it in BindingDB:
Activity Spreadsheet -- Enzyme Inhibition Constant Data from BindingDB
Found 1 hit for monomerid = 50006486
TargetAldo-keto reductase family 1 member B1(Homo sapiens (Human))
Pfizer
Curated by ChEMBL
LigandPNGBDBM50006486((5,6-Dichloro-4-hydroxy-2,2-dimethyl-chroman-4-yl)...)
Affinity DataIC50:  1.48E+4nM. Assay description: Inhibitory activity against human placental aldose reductase
In DepthDetails ArticlePubMed