BDBM50006488 (2-Ethyl-6-fluoro-4-hydroxy-chroman-4-yl)-acetic acid::CHEMBL306591
SMILES CC[C@@H]1C[C@@](O)(CC(O)=O)c2cc(F)ccc2O1
InChI Key InChIKey=ZIGWVDXSYGZSMA-NOZJJQNGSA-N
Data  1 IC50
  Tab Delimited (TSV)   2D SDfile   Computed 3D by Vconf -m prep SDfile
Find this compound or compounds like it in BindingDB:
Activity Spreadsheet -- Enzyme Inhibition Constant Data from BindingDB
Found 1 hit for monomerid = 50006488
TargetAldo-keto reductase family 1 member B1(Homo sapiens (Human))
Pfizer
Curated by ChEMBL
LigandPNGBDBM50006488((2-Ethyl-6-fluoro-4-hydroxy-chroman-4-yl)-acetic a...)
Affinity DataIC50:  620nM. Assay description: Inhibitory activity against human placental aldose reductase
In DepthDetails ArticlePubMed