BDBM50006504 (7-Chloro-4-hydroxy-2-methyl-6-nitro-chroman-4-yl)-acetic acid::CHEMBL303474
SMILES C[C@@H]1C[C@@](O)(CC(O)=O)c2cc(c(Cl)cc2O1)[N+]([O-])=O
InChI Key InChIKey=HWMWVFJUTRXUNA-SREIQFSDSA-N
Data  1 IC50
  Tab Delimited (TSV)   2D SDfile   Computed 3D by Vconf -m prep SDfile
Find this compound or compounds like it in BindingDB:
Activity Spreadsheet -- Enzyme Inhibition Constant Data from BindingDB
Found 1 hit for monomerid = 50006504
TargetAldo-keto reductase family 1 member B1(Homo sapiens (Human))
Pfizer
Curated by ChEMBL
LigandPNGBDBM50006504((7-Chloro-4-hydroxy-2-methyl-6-nitro-chroman-4-yl)...)
Affinity DataIC50:  110nM. Assay description: Inhibitory activity against human placental aldose reductase
In DepthDetails ArticlePubMed