BDBM50006536 (6-Acetyl-4-hydroxy-2-methyl-chroman-4-yl)-acetic acid::CHEMBL69646
SMILES C[C@@H]1C[C@@](O)(CC(O)=O)c2cc(ccc2O1)C(C)=O
InChI Key InChIKey=NMHHNPWLUQHYRQ-XLKFXECMSA-N
Data  1 IC50
  Tab Delimited (TSV)   2D SDfile   Computed 3D by Vconf -m prep SDfile
Find this compound or compounds like it in BindingDB:
Activity Spreadsheet -- Enzyme Inhibition Constant Data from BindingDB
Found 1 hit for monomerid = 50006536
TargetAldo-keto reductase family 1 member B1(Homo sapiens (Human))
Pfizer
Curated by ChEMBL
LigandPNGBDBM50006536((6-Acetyl-4-hydroxy-2-methyl-chroman-4-yl)-acetic ...)
Affinity DataIC50:  650nM. Assay description: Inhibitory activity against human placental aldose reductase
In DepthDetails ArticlePubMed