BDBM50006575 5-[4-(Hexane-1-sulfonyl)-[1,2,5]thiadiazol-3-yl]-1-methyl-1,2,3,6-tetrahydro-pyridine::CHEMBL75704
SMILES CCCCCCS(=O)(=O)c1nsnc1C1=CCCN(C)C1
InChI Key InChIKey=BFUKGYHLEZMWPB-UHFFFAOYSA-N
Data  2 IC50
  Tab Delimited (TSV)   2D SDfile   Computed 3D by Vconf -m prep SDfile
Find this compound or compounds like it in BindingDB:
Activity Spreadsheet -- Enzyme Inhibition Constant Data from BindingDB
Found 2 hits for monomerid = 50006575
TargetMuscarinic acetylcholine receptor M1(RAT)
Novo Nordisk Cns Division
Curated by ChEMBL
LigandPNGBDBM50006575(5-[4-(Hexane-1-sulfonyl)-[1,2,5]thiadiazol-3-yl]-1...)
Affinity DataIC50:  29nM. Assay description: In vitro binding affinity against muscarinic acetylcholine receptor M1 from rat hippocampus, using [3H]-pirenzepine (Pz) as radioligand
In DepthDetails ArticlePubMed
TargetMuscarinic acetylcholine receptor M1(RAT)
Novo Nordisk Cns Division
Curated by ChEMBL
LigandPNGBDBM50006575(5-[4-(Hexane-1-sulfonyl)-[1,2,5]thiadiazol-3-yl]-1...)
Affinity DataIC50:  29nM. Assay description: In vitro binding affinity against muscarinic acetylcholine receptor M1 from rat hippocampus, using [3H]-oxotremorine-M (Oxo-M) as radioligand
In DepthDetails ArticlePubMed