BDBM50006717 1,3-Dibutyl-8-[2-(3,4,5-trimethoxy-phenyl)-vinyl]-3,7-dihydro-purine-2,6-dione::CHEMBL74368
SMILES CCCCn1c2nc(C=Cc3cc(OC)c(OC)c(OC)c3)[nH]c2c(=O)n(CCCC)c1=O
InChI Key InChIKey=CEEBLJIHWMIBSN-UHFFFAOYSA-N
Data  2 KI
  Tab Delimited (TSV)   2D SDfile   Computed 3D by Vconf -m prep SDfile
Find this compound or compounds like it in BindingDB:
Activity Spreadsheet -- Enzyme Inhibition Constant Data from BindingDB
Found 2 hits for monomerid = 50006717
TargetAdenosine receptor A2a/A2b(Rattus norvegicus)
Kyowa Hakko Kogyo
Curated by ChEMBL
LigandPNGBDBM50006717(1,3-Dibutyl-8-[2-(3,4,5-trimethoxy-phenyl)-vinyl]-...)
Affinity DataKi:  93nM. Assay description: Binding affinity against adenosine A2 receptor from rat striatal membranes, using N-[3H]-ethyladenosin-5''-uronamide as radioligand (in the presence ...
In DepthDetails ArticlePubMed
TargetAdenosine receptor A1(GUINEA PIG)
Kyowa Hakko Kogyo
Curated by ChEMBL
LigandPNGBDBM50006717(1,3-Dibutyl-8-[2-(3,4,5-trimethoxy-phenyl)-vinyl]-...)
Affinity DataKi:  1.40E+3nM. Assay description: Binding affinity against adenosine A1 receptor from guinea pig forebrain membranes, using N6-[3H]-cyclohexyladenosine as radioligand.
In DepthDetails ArticlePubMed