BDBM50006864 CHEMBL420417::{1-[2-(2-Amino-thiazol-4-yl)-1-(1-cyclohexylmethyl-2,3-dihydroxy-5-methyl-hexylcarbamoyl)-ethylcarbamoyl]-2-phenyl-ethyl}-carbamic acid tert-butyl ester
SMILES CC(C)C[C@H](O)[C@H](O)[C@H](CC1CCCCC1)NC(=O)[C@H](Cc1csc(N)n1)NC(=O)[C@H](Cc1ccccc1)NC(=O)OC(C)(C)C
InChI Key InChIKey=MNCJMPPTISDLKZ-MYHRABSESA-N
Data  2 IC50
  Tab Delimited (TSV)   2D SDfile   Computed 3D by Vconf -m prep SDfile
Find this compound or compounds like it in BindingDB:
Activity Spreadsheet -- Enzyme Inhibition Constant Data from BindingDB
Found 2 hits for monomerid = 50006864
TargetCathepsin D(Bos taurus)
Parke-Davis Pharmaceutical Research Division Of Warner-Lambert
Curated by ChEMBL
LigandPNGBDBM50006864(CHEMBL420417 | {1-[2-(2-Amino-thiazol-4-yl)-1-(1-c...)
Affinity DataIC50:  763nM. Assay description: Inhibition of Bovine Cathepsin D
In DepthDetails ArticlePubMed
TargetRenin(Homo sapiens (Human))
Parke-Davis Pharmaceutical Research Division Of Warner-Lambert
Curated by ChEMBL
LigandPNGBDBM50006864(CHEMBL420417 | {1-[2-(2-Amino-thiazol-4-yl)-1-(1-c...)
Affinity DataIC50:  2.30nM. Assay description: In vitro inhibition of monkey renin.
In DepthDetails ArticlePubMed