BDBM50006914 (2-Butyl-5-chloro-3-{4-[2-(2H-tetrazol-5-yl)-cyclohex-1-enyl]-benzyl}-3H-imidazol-4-yl)-methanol::CHEMBL314149
SMILES CCCCc1nc(Cl)c(CO)n1Cc1ccc(cc1)C1=C(CCCC1)c1nnn[nH]1
InChI Key InChIKey=HNGCRAXRWVPURO-UHFFFAOYSA-N
Data  1 IC50
  Tab Delimited (TSV)   2D SDfile   Computed 3D by Vconf -m prep SDfile
Find this compound or compounds like it in BindingDB:
Activity Spreadsheet -- Enzyme Inhibition Constant Data from BindingDB
Found 1 hit for monomerid = 50006914
TargetType-1 angiotensin II receptor B(RAT)
Eli Lilly
Curated by ChEMBL
LigandPNGBDBM50006914((2-Butyl-5-chloro-3-{4-[2-(2H-tetrazol-5-yl)-cyclo...)
Affinity DataIC50:  3.20E+3nM. Assay description: Concentration of the compound required to inhibit binding of radioligand [125I]-AII to angiotensin II receptor, type 1 in rat adrenal glomerulosa tis...
In DepthDetails ArticlePubMed