BDBM50007045 2-[1-Methoxy-4-(naphthalen-2-ylmethoxy)-indan-1-yl]-thiazole::CHEMBL277037
SMILES COC1(CCc2c1cccc2OCc1ccc2ccccc2c1)c1nccs1
InChI Key InChIKey=AECQNBRCHXOCPU-UHFFFAOYSA-N
Data  3 IC50
  Tab Delimited (TSV)   2D SDfile   Computed 3D by Vconf -m prep SDfile
Find this compound or compounds like it in BindingDB:
Activity Spreadsheet -- Enzyme Inhibition Constant Data from BindingDB
Found 3 hits for monomerid = 50007045
TargetPolyunsaturated fatty acid 5-lipoxygenase(Homo sapiens (Human))
Ici Pharmaceuticals Group
Curated by ChEMBL
LigandPNGBDBM50007045(2-[1-Methoxy-4-(naphthalen-2-ylmethoxy)-indan-1-yl...)
Affinity DataIC50: >4.00E+4nM. Assay description: Inhibition of 5-lipoxygenase in human whole blood.
In DepthDetails ArticlePubMed
TargetPolyunsaturated fatty acid 5-lipoxygenase(Homo sapiens (Human))
Ici Pharmaceuticals Group
Curated by ChEMBL
LigandPNGBDBM50007045(2-[1-Methoxy-4-(naphthalen-2-ylmethoxy)-indan-1-yl...)
Affinity DataIC50: >4.00E+4nM. Assay description: Inhibition of 5-lipoxygenase from human whole blood
In DepthDetails ArticlePubMed
TargetPolyunsaturated fatty acid 5-lipoxygenase(Mus musculus)
Ici Pharmaceuticals Group
Curated by ChEMBL
LigandPNGBDBM50007045(2-[1-Methoxy-4-(naphthalen-2-ylmethoxy)-indan-1-yl...)
Affinity DataIC50:  1.30E+4nM. Assay description: Inhibition of 5-lipoxygenase in mouse macrophages.
In DepthDetails ArticlePubMed