BDBM50007054 5-{1-Methoxy-1-[3-(naphthalen-2-ylmethoxy)-phenyl]-propyl}-thiazole::CHEMBL416735
SMILES CCC(OC)(c1cncs1)c1cccc(OCc2ccc3ccccc3c2)c1
InChI Key InChIKey=UGNLBYOFOZADGD-UHFFFAOYSA-N
Data  2 IC50
  Tab Delimited (TSV)   2D SDfile   Computed 3D by Vconf -m prep SDfile
Find this compound or compounds like it in BindingDB:
Activity Spreadsheet -- Enzyme Inhibition Constant Data from BindingDB
Found 2 hits for monomerid = 50007054
TargetPolyunsaturated fatty acid 5-lipoxygenase(Homo sapiens (Human))
Astrazeneca
Curated by ChEMBL
LigandPNGBDBM50007054(5-{1-Methoxy-1-[3-(naphthalen-2-ylmethoxy)-phenyl]...)
Affinity DataIC50:  6.30E+3nM. Assay description: Inhibition of 5-lipoxygenase from human whole blood
In DepthDetails ArticlePubMed
TargetPolyunsaturated fatty acid 5-lipoxygenase(Homo sapiens (Human))
Astrazeneca
Curated by ChEMBL
LigandPNGBDBM50007054(5-{1-Methoxy-1-[3-(naphthalen-2-ylmethoxy)-phenyl]...)
Affinity DataIC50:  6.30E+3nM. Assay description: Inhibition of 5-lipoxygenase in human whole blood.
In DepthDetails ArticlePubMed