BDBM50007059 1-Thiazol-2-yl-1-[3-(3-p-tolyl-prop-2-ynyloxy)-phenyl]-propan-1-ol::CHEMBL70055
SMILES CCC(O)(c1nccs1)c1cccc(OCC#Cc2ccc(C)cc2)c1
InChI Key InChIKey=OQCUYOAAHUCBPZ-UHFFFAOYSA-N
Data  1 IC50
  Tab Delimited (TSV)   2D SDfile   Computed 3D by Vconf -m prep SDfile
Find this compound or compounds like it in BindingDB:
Activity Spreadsheet -- Enzyme Inhibition Constant Data from BindingDB
Found 1 hit for monomerid = 50007059
TargetPolyunsaturated fatty acid 5-lipoxygenase(Homo sapiens (Human))
Ici Pharmaceuticals Group
Curated by ChEMBL
LigandPNGBDBM50007059(1-Thiazol-2-yl-1-[3-(3-p-tolyl-prop-2-ynyloxy)-phe...)
Affinity DataIC50:  2.20E+4nM. Assay description: Inhibition of 5-lipoxygenase in human whole blood.
In DepthDetails ArticlePubMed